Target
Short transient receptor potential channel 6
Ligand
BDBM466620
Substrate
Meas. Tech.
High Throughput Screening Assay
IC50
97.0±n/a nM
Citation
 Bouyssou, TGottschling, DHeine, NSmith Keenan, LLLowe, MDRazavi, HSarko, CRSurprenant, STakahashi, HTurner, MRWu, X Inhibitors of TRPC6 US Patent  US10889568 Publication Date 1/12/2021 
Target
Name:
Short transient receptor potential channel 6
Synonyms:
TRP-6 TRPC6 Transient receptor protein 6
Type:
PROTEIN
Mol. Mass.:
106326.67
Organism:
Homo sapiens (Human)
Description:
ChEMBL_107640
Residue:
931
  
Inhibitor
Name:
BDBM466620
Synonyms:
US10800757, Compound 36 [4-(6-Amino-pyridazin-3-yl)- piperidin-1-yl]-(5-isobutoxy-4- methoxy-pyridin-2-yl)-methanone
Type:
Small organic molecule
Emp. Form.:
C20H27N5O3
Mol. Mass.:
385.4601
SMILES:
COc1cc(ncc1OCC(C)C)C(=O)N1CCC(CC1)c1ccc(N)nn1
: