Target
Vasopressin V1a receptor
Ligand
BDBM477636
Substrate
Meas. Tech.
Inhibition Activity Assay
IC50
4400±n/a nM
Citation
 Li, XHe, WWang, BZhang, ZHe, FTao, W Condensed ring group azacyclobutyl triazole derivative, preparation method therefor and use thereof in medicine US Patent  US10889569 Publication Date 1/12/2021 
Target
Name:
Vasopressin V1a receptor
Synonyms:
AVPR V1a AVPR1A V1AR_HUMAN VASOPRESSIN V1A Vasopressin V1 receptor Vasopressin receptor
Type:
Receptor
Mol. Mass.:
46820.18
Organism:
Homo sapiens (Human)
Description:
P37288
Residue:
418
  
Inhibitor
Name:
BDBM477636
Synonyms:
5-Fluoro-1-(1-(5-(methoxymethyl)-4-(6-methoxypyridin-3-yl)-4H-1,2,4-triazol-3-yl) azetidin-3-yl)-3-methyl-1H-indole 17 | US10889569, Example 17
Type:
Small organic molecule
Emp. Form.:
C22H23FN6O2
Mol. Mass.:
422.4554
SMILES:
COCc1nnc(N2CC(C2)n2cc(C)c3cc(F)ccc23)n1-c1ccc(OC)nc1
: