Target
Vasopressin V1b receptor
Ligand
BDBM477648
Substrate
Meas. Tech.
Inhibition Activity Assay
IC50
54500±n/a nM
Citation
 Li, XHe, WWang, BZhang, ZHe, FTao, W Condensed ring group azacyclobutyl triazole derivative, preparation method therefor and use thereof in medicine US Patent  US10889569 Publication Date 1/12/2021 
Target
Name:
Vasopressin V1b receptor
Synonyms:
AVPR V1b AVPR1B Antidiuretic hormone receptor 1b V1bR VPR3 Vasopressin V1b receptor (V1b) Vasopressin V3 receptor
Type:
Enzyme
Mol. Mass.:
46985.01
Organism:
Homo sapiens (Human)
Description:
P47901
Residue:
424
  
Inhibitor
Name:
BDBM477648
Synonyms:
4-(1-(5-(Ethoxymethyl)-4-(6-methoxypyridin-3-yl)-4H-1,2,4-triazol-3-yl)azetidin-3-yl)-7-fluoro-3,4-dihydro-2H-benzo[b][1,4]oxazine 31 | US10889569, Example 31
Type:
Small organic molecule
Emp. Form.:
C22H25FN6O3
Mol. Mass.:
440.4707
SMILES:
CCOCc1nnc(N2CC(C2)N2CCOc3cc(F)ccc23)n1-c1ccc(OC)nc1
: