Target
Vasopressin V2 receptor
Ligand
BDBM477633
Substrate
Meas. Tech.
Inhibition Activity Assay
IC50
25700±n/a nM
Citation
 Li, XHe, WWang, BZhang, ZHe, FTao, W Condensed ring group azacyclobutyl triazole derivative, preparation method therefor and use thereof in medicine US Patent  US10889569 Publication Date 1/12/2021 
Target
Name:
Vasopressin V2 receptor
Synonyms:
ADHR AVPR2 DIR Renal-type arginine vasopressin receptor V2R_HUMAN Vasopressin V2 receptor | Vasopressin receptor
Type:
Receptor
Mol. Mass.:
40295.28
Organism:
Homo sapiens (Human)
Description:
P30518
Residue:
371
  
Inhibitor
Name:
BDBM477633
Synonyms:
5-(3-(3-(6-Fluorobenzofuran-3-yl)azetidin-1-yl)-5-(methoxymethyl)-4H-1,2,4-triazol-4-yl)-2-methoxypyridine 11 | US10889569, Example 11
Type:
Small organic molecule
Emp. Form.:
C21H20FN5O3
Mol. Mass.:
409.4136
SMILES:
COCc1nnc(N2CC(C2)c2coc3cc(F)ccc23)n1-c1ccc(OC)nc1
: