Target
Vasopressin V2 receptor
Ligand
BDBM477660
Substrate
Meas. Tech.
Inhibition Activity Assay
IC50
52000±n/a nM
Citation
 Li, XHe, WWang, BZhang, ZHe, FTao, W Condensed ring group azacyclobutyl triazole derivative, preparation method therefor and use thereof in medicine US Patent  US10889569 Publication Date 1/12/2021 
Target
Name:
Vasopressin V2 receptor
Synonyms:
ADHR AVPR2 DIR Renal-type arginine vasopressin receptor V2R_HUMAN Vasopressin V2 receptor | Vasopressin receptor
Type:
Receptor
Mol. Mass.:
40295.28
Organism:
Homo sapiens (Human)
Description:
P30518
Residue:
371
  
Inhibitor
Name:
BDBM477660
Synonyms:
5-Fluoro-1-(1-(5-(methoxymethyl)-4-(6-methoxypyridin-3-yl)-4H-1,2,4-triazol-3-yl) azetidin-3-yl)indoline 23 | US10889569, Example 23
Type:
Small organic molecule
Emp. Form.:
C21H23FN6O2
Mol. Mass.:
410.4447
SMILES:
COCc1nnc(N2CC(C2)N2CCc3cc(F)ccc23)n1-c1ccc(OC)nc1
: