Target
Beta-secretase 2
Ligand
BDBM477913
Substrate
Meas. Tech.
In Vitro Enzymatic FRET (Fluorescence Resonance Energy Transfer) Assays
IC50
166±n/a nM
Citation
 Allen, JRAmegadzie, ABourbeau, MPChen, JJFrohn, MJHarrington, PELow, JDMa, VVNguyen, TTPickrell, AReeves, C Cyclopropyl fused thiazine derivatives as beta-secretase inhibitors and methods of use US Patent  US10889581 Publication Date 1/12/2021 
Target
Name:
Beta-secretase 2
Synonyms:
AEPLC ASP1 Asp 1 Aspartyl protease 1 BACE2_HUMAN Beta-secretase (BACE) Beta-secretase 2 (BACE-2) Beta-site APP-cleaving enzyme 2 Memapsin-1 beta-Secretase (BACE-2)
Type:
Protein
Mol. Mass.:
56171.20
Organism:
Homo sapiens (Human)
Description:
Q9Y5Z0
Residue:
518
  
Inhibitor
Name:
BDBM477913
Synonyms:
6-((3-((1R,5S,6S)-3-amino-5-(fluoromethyl)-1-((E)-3-morpholino-3-oxoprop-1-en-1-yl)-2-thia-4-azabicyclo[4.1.0]hept-3-en-5-yl)-4-fluorophenyl)ethynyl)-5-methylnicotinonitrile | US10889581, Example 116
Type:
Small organic molecule
Emp. Form.:
C28H25F2N5O2S
Mol. Mass.:
533.592
SMILES:
Cc1cc(cnc1C#Cc1ccc(F)c(c1)[C@@]1(CF)N=C(N)S[C@]2(C[C@@H]12)\C=C\C(=O)N1CCOCC1)C#N
: