Target
Cathepsin D
Ligand
BDBM477916
Substrate
Meas. Tech.
In Vitro Enzymatic FRET Assay
IC50
188000±n/a nM
Citation
 Allen, JRAmegadzie, ABourbeau, MPChen, JJFrohn, MJHarrington, PELow, JDMa, VVNguyen, TTPickrell, AReeves, C Cyclopropyl fused thiazine derivatives as beta-secretase inhibitors and methods of use US Patent  US10889581 Publication Date 1/12/2021 
Target
Name:
Cathepsin D
Synonyms:
CATD_HUMAN CTSD Cathepsin D heavy chain Cathepsin D precursor
Type:
Enzyme
Mol. Mass.:
44551.72
Organism:
Homo sapiens (Human)
Description:
Human proCathepsin D (SwissProt accession number P07339) was expressed in Sf9 cells, purified, and autoactivated.
Residue:
412
  
Inhibitor
Name:
BDBM477916
Synonyms:
6-((3-((1S,5S,6S)-3-amino-5-(fluoromethyl)-1-(3-morpholino-3-oxopropyl)-2-thia-4-azabicyclo[4.1.0]hept-3-en-5-yl)-4-fluorophenyl)ethynyl)nicotinonitrile | US10889581, Example 119
Type:
Small organic molecule
Emp. Form.:
C27H25F2N5O2S
Mol. Mass.:
521.582
SMILES:
NC1=N[C@@](CF)([C@@H]2C[C@]2(CCC(=O)N2CCOCC2)S1)c1cc(ccc1F)C#Cc1ccc(cn1)C#N
: