Target
ATR-interacting protein/Serine/threonine-protein kinase ATR
Ligand
BDBM478107
Substrate
Meas. Tech.
ATR/ATRIP Enzymatic Assay
IC50
31.0±n/a nM
Citation
 Di Francesco, MEJones, PCarroll, CLRamaswamy, SKKang, ZJohnson, MGLively, SLapointe, D Heterocyclic inhibitors of ATR kinase US Patent  US10894052 Publication Date 1/19/2021 
Target
Name:
ATR-interacting protein/Serine/threonine-protein kinase ATR
Synonyms:
ATR/ATRIP
Type:
Enzyme
Mol. Mass.:
Description:
Components:
This complex has 2 components.
Component 1
Name:
Serine/threonine-protein kinase ATR
Synonyms:
ATR Ataxia telangiectasia and Rad3-related protein (ATR) FRP1 | Serine-protein kinase ATR
Type:
Protein
Mol. Mass.:
301404.58
Organism:
Homo sapiens (Human)
Description:
Q13535
Residue:
2644
  
Component 2
Name:
ATR-interacting protein
Synonyms:
AGS1 ATR-interacting protein (ATRIP) ATRIP_HUMAN
Type:
Enzyme Catalytic Domain
Mol. Mass.:
85833.30
Organism:
Homo sapiens (Human)
Description:
Q8WXE1
Residue:
791
  
Inhibitor
Name:
BDBM478107
Synonyms:
(R)-Cyclopropyl(methyl)((4-((R)-3-methylmorpholino)-6-(1H-pyrrolo[2,3-b]pyridin-4-yl)pyridin-2-yl)imino)-λ6-sulfanone | US10894052, Example 3a
Type:
Small organic molecule
Emp. Form.:
C21H25N5O2S
Mol. Mass.:
411.521
SMILES:
C[C@@H]1COCCN1c1cc(N=[S@](C)(=O)C2CC2)nc(c1)-c1ccnc2[nH]ccc12
: