Target
ATR-interacting protein/Serine/threonine-protein kinase ATR
Ligand
BDBM478123
Substrate
Meas. Tech.
ATR/ATRIP Enzymatic Assay
IC50
29.0±n/a nM
Citation
 Di Francesco, MEJones, PCarroll, CLRamaswamy, SKKang, ZJohnson, MGLively, SLapointe, D Heterocyclic inhibitors of ATR kinase US Patent  US10894052 Publication Date 1/19/2021 
Target
Name:
ATR-interacting protein/Serine/threonine-protein kinase ATR
Synonyms:
ATR/ATRIP
Type:
Enzyme
Mol. Mass.:
Description:
Components:
This complex has 2 components.
Component 1
Name:
Serine/threonine-protein kinase ATR
Synonyms:
ATR Ataxia telangiectasia and Rad3-related protein (ATR) FRP1 | Serine-protein kinase ATR
Type:
Protein
Mol. Mass.:
301404.58
Organism:
Homo sapiens (Human)
Description:
Q13535
Residue:
2644
  
Component 2
Name:
ATR-interacting protein
Synonyms:
AGS1 ATR-interacting protein (ATRIP) ATRIP_HUMAN
Type:
Enzyme Catalytic Domain
Mol. Mass.:
85833.30
Organism:
Homo sapiens (Human)
Description:
Q8WXE1
Residue:
791
  
Inhibitor
Name:
BDBM478123
Synonyms:
(R)-((6-(6-ethoxy-1H-pyrrolo [2,3-b]pyridin-4-yl)-4-(3- methylmorpholino)pyridin-2- yl)imino)dimethyl-lambda6-sulfanone | US10894052, Example 18
Type:
Small organic molecule
Emp. Form.:
C21H27N5O3S
Mol. Mass.:
429.536
SMILES:
CCOc1cc(-c2cc(cc(N=S(C)(C)=O)n2)N2CCOC[C@H]2C)c2cc[nH]c2n1
: