Target
ATR-interacting protein/Serine/threonine-protein kinase ATR
Ligand
BDBM478139
Substrate
Meas. Tech.
ATR/ATRIP Enzymatic Assay
IC50
3469±n/a nM
Citation
 Di Francesco, MEJones, PCarroll, CLRamaswamy, SKKang, ZJohnson, MGLively, SLapointe, D Heterocyclic inhibitors of ATR kinase US Patent  US10894052 Publication Date 1/19/2021 
Target
Name:
ATR-interacting protein/Serine/threonine-protein kinase ATR
Synonyms:
ATR/ATRIP
Type:
Enzyme
Mol. Mass.:
Description:
Components:
This complex has 2 components.
Component 1
Name:
Serine/threonine-protein kinase ATR
Synonyms:
ATR Ataxia telangiectasia and Rad3-related protein (ATR) FRP1 | Serine-protein kinase ATR
Type:
Protein
Mol. Mass.:
301404.58
Organism:
Homo sapiens (Human)
Description:
Q13535
Residue:
2644
  
Component 2
Name:
ATR-interacting protein
Synonyms:
AGS1 ATR-interacting protein (ATRIP) ATRIP_HUMAN
Type:
Enzyme Catalytic Domain
Mol. Mass.:
85833.30
Organism:
Homo sapiens (Human)
Description:
Q8WXE1
Residue:
791
  
Inhibitor
Name:
BDBM478139
Synonyms:
(R)-dimethyl((6-(1-methyl-1H- imidazol-2-yl)-4-(3- methylmorpholino)pyridin-2- yl)imino)-lambda6-sulfanone | US10894052, Example 31
Type:
Small organic molecule
Emp. Form.:
C16H23N5O2S
Mol. Mass.:
349.451
SMILES:
C[C@@H]1COCCN1c1cc(N=S(C)(C)=O)nc(c1)-c1nccn1C
: