Target
Serine/threonine-protein kinase TBK1
Ligand
BDBM478573
Substrate
Meas. Tech.
TBK1 Low ATP Kinase Assay
IC50
0.610±n/a nM
Citation
 Schulze, VHeinrich, TPrinz, FLefranc, JSchröder, JMengel, ABone, WBálint, JWengner, AMEis, KIrlbacher, HKoppitz, MBömer, UBader, BBriem, HLienau, PChrist, CStöckigt, DHillig, R Heteroarylbenzimidazole compounds US Patent  US10894784 Publication Date 1/19/2021 
Target
Name:
Serine/threonine-protein kinase TBK1
Synonyms:
NAK Protein cereblon/Serine/threonine-protein kinase TBK1 TANK-binding kinase 1 (TBK-1) TBK1 | TBK1_HUMAN
Type:
protein
Mol. Mass.:
83645.20
Organism:
Homo sapiens (Human)
Description:
Q9UHD2
Residue:
729
  
Inhibitor
Name:
BDBM478573
Synonyms:
US10894784, Example 55.03.01 cyclopropyl{4-[(1R or 1S)-1-(2-{[6-(1-{[(1R or 1S)-2,2-difluorocyclopropyl]methyl}-1H-pyrazol-4-yl)-1H-benzimidazol-2-yl]amino}pyridin-4-yl)ethyl]piperazin-1-yl}methanone
Type:
Small organic molecule
Emp. Form.:
C29H32F2N8O
Mol. Mass.:
546.6142
SMILES:
CC(N1CCN(CC1)C(=O)C1CC1)c1ccnc(Nc2nc3ccc(cc3[nH]2)-c2cnn(CC3CC3(F)F)c2)c1
: