Target
Cyclin-dependent kinase 12
Ligand
BDBM478972
Substrate
Meas. Tech.
Protein kinase assay (Condition A: Thiol Containing Conditions)
IC50
550±n/a nM
Citation
 Kanouni, TArnold, LDKaldor, SWMurphy, EATyhonas, J Inhibitors of cyclin-dependent kinases US Patent  US10894788 Publication Date 1/19/2021 
Target
Name:
Cyclin-dependent kinase 12
Synonyms:
2.7.11.22 CDC2-related protein kinase 7 CDK12_HUMAN CRKRS Cell division cycle 2-related protein kinase 7 Cyclin-dependent kinase 12 hCDK12
Type:
PROTEIN
Mol. Mass.:
164218.64
Organism:
Homo sapiens
Description:
ChEMBL_117739
Residue:
1490
  
Inhibitor
Name:
BDBM478972
Synonyms:
(R)-N-(4-(3-((5-chloropyrimidin-2- yl)amino)pyrrolidine-1-carbonyl)-2- (1-methyl-1H-pyrazol-4- yl)phenyl)acrylamide US10894788, Example 69 | US11390618, Example 69
Type:
Small organic molecule
Emp. Form.:
C22H22ClN7O2
Mol. Mass.:
451.909
SMILES:
Cn1cc(cn1)-c1cc(ccc1NC(=O)C=C)C(=O)N1CC[C@H](C1)Nc1ncc(Cl)cn1
: