Target
Cyclin-dependent kinase 12
Ligand
BDBM479063
Substrate
Meas. Tech.
Protein kinase assay (Condition B: Thiol-free Conditions)
IC50
550±n/a nM
Citation
 Kanouni, TArnold, LDKaldor, SWMurphy, EATyhonas, J Inhibitors of cyclin-dependent kinases US Patent  US10894788 Publication Date 1/19/2021 
Target
Name:
Cyclin-dependent kinase 12
Synonyms:
2.7.11.22 CDC2-related protein kinase 7 CDK12_HUMAN CRKRS Cell division cycle 2-related protein kinase 7 Cyclin-dependent kinase 12 hCDK12
Type:
PROTEIN
Mol. Mass.:
164218.64
Organism:
Homo sapiens
Description:
ChEMBL_117739
Residue:
1490
  
Inhibitor
Name:
BDBM479063
Synonyms:
N-(4-((R)-3-((5-chloropyrimidin-2- yl)amino)pyrrolidine-1-carbonyl)-2- ((tetrahydrofuran-3- yl)oxy)phenyl)acrylamide US11390618, Example 103
Type:
Small organic molecule
Emp. Form.:
C22H24ClN5O4
Mol. Mass.:
457.91
SMILES:
Clc1cnc(N[C@@H]2CCN(C2)C(=O)c2ccc(NC(=O)C=C)c(OC3CCOC3)c2)nc1
: