Target
Cyclin-dependent kinase 12
Ligand
BDBM479065
Substrate
Meas. Tech.
Protein kinase assay (Condition B: Thiol-free Conditions)
IC50
550±n/a nM
Citation
 Kanouni, TArnold, LDKaldor, SWMurphy, EATyhonas, J Inhibitors of cyclin-dependent kinases US Patent  US10894788 Publication Date 1/19/2021 
Target
Name:
Cyclin-dependent kinase 12
Synonyms:
2.7.11.22 CDC2-related protein kinase 7 CDK12_HUMAN CRKRS Cell division cycle 2-related protein kinase 7 Cyclin-dependent kinase 12 hCDK12
Type:
PROTEIN
Mol. Mass.:
164218.64
Organism:
Homo sapiens
Description:
ChEMBL_117739
Residue:
1490
  
Inhibitor
Name:
BDBM479065
Synonyms:
(R)-N-(3-(3-((5-chloro-4- methoxypyrimidin-2- yl)amino)pyrrolidine-1- carbonyl)phenyl)acrylamide US11390618, Example 105
Type:
Small organic molecule
Emp. Form.:
C19H20ClN5O3
Mol. Mass.:
401.847
SMILES:
COc1nc(N[C@@H]2CCN(C2)C(=O)c2cccc(NC(=O)C=C)c2)ncc1Cl
: