Target
Cyclin-dependent kinase 12
Ligand
BDBM479073
Substrate
Meas. Tech.
Protein kinase assay (Condition A: Thiol Containing Conditions)
IC50
550±n/a nM
Citation
 Kanouni, TArnold, LDKaldor, SWMurphy, EATyhonas, J Inhibitors of cyclin-dependent kinases US Patent  US10894788 Publication Date 1/19/2021 
Target
Name:
Cyclin-dependent kinase 12
Synonyms:
2.7.11.22 CDC2-related protein kinase 7 CDK12_HUMAN CRKRS Cell division cycle 2-related protein kinase 7 Cyclin-dependent kinase 12 hCDK12
Type:
PROTEIN
Mol. Mass.:
164218.64
Organism:
Homo sapiens
Description:
ChEMBL_117739
Residue:
1490
  
Inhibitor
Name:
BDBM479073
Synonyms:
(R)-N-(4-(3-((5-ethynylpyrimidin-2- yl)amino)pyrrolidine-1- carbonyl)phenyl)-N- methylacrylamide | US10894788, Example 113
Type:
Small organic molecule
Emp. Form.:
C21H25N5O2
Mol. Mass.:
379.4555
SMILES:
CCc1cnc(N[C@@H]2CCN(C2)C(=O)c2ccc(cc2)N(C)C(=O)C=C)nc1
: