Target
Cyclin-dependent kinase 12
Ligand
BDBM479119
Substrate
Meas. Tech.
Protein kinase assay (Condition B: Thiol-free Conditions)
IC50
5500±n/a nM
Citation
 Kanouni, TArnold, LDKaldor, SWMurphy, EATyhonas, J Inhibitors of cyclin-dependent kinases US Patent  US10894788 Publication Date 1/19/2021 
Target
Name:
Cyclin-dependent kinase 12
Synonyms:
2.7.11.22 CDC2-related protein kinase 7 CDK12_HUMAN CRKRS Cell division cycle 2-related protein kinase 7 Cyclin-dependent kinase 12 hCDK12
Type:
PROTEIN
Mol. Mass.:
164218.64
Organism:
Homo sapiens
Description:
ChEMBL_117739
Residue:
1490
  
Inhibitor
Name:
BDBM479119
Synonyms:
(R)-N-(4-(3-((5-bromopyrimidin-2- yl)amino)pyrrolidine-1-carbonyl)-2- ((2- (dimethylamino)ethyl)(methyl) amino)phenyl)acrylamide US11390618, Example 159
Type:
Small organic molecule
Emp. Form.:
C23H30BrN7O2
Mol. Mass.:
516.434
SMILES:
CN(C)CCN(C)c1cc(ccc1NC(=O)C=C)C(=O)N1CC[C@H](C1)Nc1ncc(Br)cn1
: