Target
Cyclin-dependent kinase 12
Ligand
BDBM479139
Substrate
Meas. Tech.
Protein kinase assay (Condition B: Thiol-free Conditions)
IC50
<100±n/a nM
Citation
 Kanouni, TArnold, LDKaldor, SWMurphy, EATyhonas, J Inhibitors of cyclin-dependent kinases US Patent  US10894788 Publication Date 1/19/2021 
Target
Name:
Cyclin-dependent kinase 12
Synonyms:
2.7.11.22 CDC2-related protein kinase 7 CDK12_HUMAN CRKRS Cell division cycle 2-related protein kinase 7 Cyclin-dependent kinase 12 hCDK12
Type:
PROTEIN
Mol. Mass.:
164218.64
Organism:
Homo sapiens
Description:
ChEMBL_117739
Residue:
1490
  
Inhibitor
Name:
BDBM479139
Synonyms:
N-(4-((2S,4R)-4-((5-chloro-4- methoxypyrimidin-2-yl)amino)-2- methylpyrrolidine-1- carbonyl)phenyl)acrylamide US11390618, Example 180
Type:
Small organic molecule
Emp. Form.:
C20H22ClN5O3
Mol. Mass.:
415.873
SMILES:
COc1nc(N[C@@H]2C[C@H](C)N(C2)C(=O)c2ccc(NC(=O)C=C)cc2)ncc1Cl
: