Target
Tyrosine-protein phosphatase non-receptor type 11
Ligand
BDBM479342
Substrate
Meas. Tech.
SHP2 Allosteric Inhibition Assay
IC50
4.20±n/a nM
Citation
 Fu, JLou, YHe, Y Fused tricyclic ring derivatives as SRC homology-2 phosphatase inhibitors US Patent  US10894797 Publication Date 1/19/2021 
Target
Name:
Tyrosine-protein phosphatase non-receptor type 11
Synonyms:
PTN11_HUMAN PTP-2C PTPN11 Protein tyrosine phosphatase (PTP) Shp2 Protein-tyrosine phosphatase 2C SHP2 Src homology phosphatase 2 (SHP-2) Tyrosine-protein phosphatase non-receptor type 11 (PTPN11) Tyrosine-protein phosphatase non-receptor type 11 (SHP2)
Type:
Protein phosphatase
Mol. Mass.:
68443.59
Organism:
Homo sapiens (Human)
Description:
Q06124
Residue:
597
  
Inhibitor
Name:
BDBM479342
Synonyms:
(3-((3S,4S)-4-amino-3-methyl-2-oxa-8- azaspiro[4.5]decan-8-yl)- 6-(((6aS,8S)-8-((methoxymethoxy)methyl)- 6a,7,8,9-tetrahydro-6H-pyrido[3,2-b]pyrrolo[1,2- d][1,4]oxazin-4-yl)thio)pyrazin-2-yl)methanol US11034705, Compound 31 | US11518772, Compound 31
Type:
Small organic molecule
Emp. Form.:
C27H38N6O5S
Mol. Mass.:
558.693
SMILES:
COCOC[C@H]1C[C@H]2COc3c(Sc4cnc(N5CCC6(CO[C@@H](C)[C@H]6N)CC5)c(CO)n4)ccnc3N2C1
: