Target
Tyrosine-protein phosphatase non-receptor type 11
Ligand
BDBM479359
Substrate
Meas. Tech.
SHP2 Allosteric Inhibition Assay
IC50
3.30±n/a nM
Citation
 Fu, JLou, YHe, Y Fused tricyclic ring derivatives as SRC homology-2 phosphatase inhibitors US Patent  US10894797 Publication Date 1/19/2021 
Target
Name:
Tyrosine-protein phosphatase non-receptor type 11
Synonyms:
3.1.3.48 PTP-1D PTP2C Protein Tyrosine Phosphatase PPN11/Shp2 Protein-Tyrosine Phosphatase SHP-2 Protein-tyrosine phosphatase 2C SH-PTP3 SHP2 Src homology phosphatase 2 (SHP-2) Tyrosine-protein phosphatase non-receptor type 11 (SHP-2) | Tyrosine-protein phosphatase non-receptor type 11 (SHP2)
Type:
Protein phosphatase
Mol. Mass.:
68443.59
Organism:
Homo sapiens (Human)
Description:
Q06124
Residue:
593
  
Inhibitor
Name:
BDBM479359
Synonyms:
(3-((S)-5-amino-5,7-dihydro- spiro[cyclopenta[b]pyridine-6,4'- piperidin]-1'-yl)-6-(((6aS,8S)-8-((methoxy- methoxy)methyl)- 6a,7,8,9-tetrahydro-6H-pyrido[3,2-b]pyrrolo[1,2- d][1,4]oxazin-4-yl)thio)pyrazin-2-yl)methanol US11034705, Compound 48 | US11518772, Compound 48
Type:
Small organic molecule
Emp. Form.:
C30H37N7O4S
Mol. Mass.:
591.724
SMILES:
COCOC[C@H]1C[C@H]2COc3c(Sc4cnc(N5CCC6(Cc7ncccc7[C@H]6N)CC5)c(CO)n4)ccnc3N2C1
: