Target
Cation-independent mannose-6-phosphate receptor
Ligand
BDBM479366
Substrate
Meas. Tech.
Binding of the M6P Analogs of the Invention with CI-M6PR
IC50
17000±n/a nM
Citation
 Morere, ADa Silva, ABouffard, EEl Cheikh, KDurand, JMaynadier, MBasile, I Multi-functionalized polysaccharide compounds and use thereof for targeting the cation-independent mannose 6-phosphate receptor US Patent  US10894803 Publication Date 1/19/2021 
Target
Name:
Cation-independent mannose-6-phosphate receptor
Synonyms:
300 kDa mannose 6-phosphate receptor CI-M6PR IGF-II receptor Insulin-like growth factor 2 receptor M6P/IGF2 receptor M6PR MPRI | MPRI_HUMAN
Type:
PROTEIN
Mol. Mass.:
274350.28
Organism:
Homo sapiens (Human)
Description:
ChEMBL_99803
Residue:
2491
  
Inhibitor
Name:
BDBM479366
Synonyms:
US10894803, Compound 24 of the invention M6C-alpha(1,2)-Man-Ethyl-NH2
Type:
Small organic molecule
Emp. Form.:
C16H29NO12
Mol. Mass.:
427.401
SMILES:
NCCO[C@H]1OC(CO)[C@@H](O)[C@H](O)C1O[C@H]1OC(CCC(O)=O)[C@@H](O)[C@H](O)C1O
: