Target
Glutamate carboxypeptidase 2
Ligand
BDBM479373
Substrate
Meas. Tech.
Enzymatic Assay for In Vitro Evaluation of PSMA Inhibitors
Ki
15.6±n/a nM
Citation
 Wang, EKolb, HCSzardenings, AKLiu, CWalsh, JCChen, GSinha, AKasi, DYu, CGangadharmath, UBZhang, WZhao, TMocharla, VP PSMA imaging agents US Patent  US10894807 Publication Date 1/19/2021 
Target
Name:
Glutamate carboxypeptidase 2
Synonyms:
FGCP FOLH1 Folate hydrolase 1 Glutamate carboxypeptidase 2 Membrane glutamate carboxypeptidase NAALAD1 PSM Prostate-specific membrane antigen mGCP
Type:
PROTEIN
Mol. Mass.:
84333.66
Organism:
Homo sapiens (Human)
Description:
ChEMBL_1497035
Residue:
750
  
Inhibitor
Name:
BDBM479373
Synonyms:
US10894807, ID P018
Type:
Small organic molecule
Emp. Form.:
C21H29N3O9
Mol. Mass.:
467.4697
SMILES:
CN([C@@H](CCCCNC(=O)OCc1ccccc1)C(O)=O)C(=O)N[C@@H](CCC(O)=O)C(O)=O
: