Target
Glutamate carboxypeptidase 2
Ligand
BDBM479456
Substrate
Meas. Tech.
Enzymatic Assay for In Vitro Evaluation of PSMA Inhibitors
Ki
1.30±n/a nM
Citation
 Wang, EKolb, HCSzardenings, AKLiu, CWalsh, JCChen, GSinha, AKasi, DYu, CGangadharmath, UBZhang, WZhao, TMocharla, VP PSMA imaging agents US Patent  US10894807 Publication Date 1/19/2021 
Target
Name:
Glutamate carboxypeptidase 2
Synonyms:
FGCP FOLH1 Folate hydrolase 1 Glutamate carboxypeptidase 2 Membrane glutamate carboxypeptidase NAALAD1 PSM Prostate-specific membrane antigen mGCP
Type:
PROTEIN
Mol. Mass.:
84333.66
Organism:
Homo sapiens (Human)
Description:
ChEMBL_1497035
Residue:
750
  
Inhibitor
Name:
BDBM479456
Synonyms:
US10894807, ID P276
Type:
Small organic molecule
Emp. Form.:
C36H55FN10O17
Mol. Mass.:
918.8771
SMILES:
OC(=O)CCC(NC(=O)NC(CCCCNC(=O)CC(CC(=O)NCCCC[C@@H](NC(=O)N[C@@H](CCC(O)=O)C(O)=O)C(O)=O)NC(=O)Cn1cc(CCCF)nn1)C(O)=O)C(O)=O
: