Target
Adenosine receptor A1
Ligand
BDBM479520
Substrate
Meas. Tech.
Binding Affinity Assay
IC50
52.0±n/a nM
Citation
 Qi, CTsui, HZeng, QYang, ZZhang, X Pyrazine compounds and uses thereof US Patent  US10898481 Publication Date 1/26/2021 
Target
Name:
Adenosine receptor A1
Synonyms:
A1 adenosine receptor (hA1) AA1R_HUMAN ADORA1 Adenosine A1-receptor Adenosine receptor A1 (hA1) | Adenosine transporter (AdT)
Type:
G Protein-Coupled Receptor (GPCR)
Mol. Mass.:
36520.92
Organism:
Homo sapiens (Human)
Description:
P30542
Residue:
326
  
Inhibitor
Name:
BDBM479520
Synonyms:
3-amino-6-(2,6-dimethylpyridin-4-yl)- N-(2-methoxybenzyl)-5-(5- methylfuran-2-yl)pyrazine-2-carboxamide US11571420, Compound 61
Type:
Small organic molecule
Emp. Form.:
C25H25N5O3
Mol. Mass.:
443.4977
SMILES:
COc1ccccc1CNC(=O)c1nc(-c2cc(C)nc(C)c2)c(nc1N)-c1ccc(C)o1
: