Target
Adenosine receptor A1
Ligand
BDBM479535
Substrate
Meas. Tech.
Binding Affinity Assay
IC50
182±n/a nM
Citation
 Qi, CTsui, HZeng, QYang, ZZhang, X Pyrazine compounds and uses thereof US Patent  US10898481 Publication Date 1/26/2021 
Target
Name:
Adenosine receptor A1
Synonyms:
A1 adenosine receptor (hA1) AA1R_HUMAN ADORA1 Adenosine A1-receptor Adenosine receptor A1 (hA1) | Adenosine transporter (AdT)
Type:
G Protein-Coupled Receptor (GPCR)
Mol. Mass.:
36520.92
Organism:
Homo sapiens (Human)
Description:
P30542
Residue:
326
  
Inhibitor
Name:
BDBM479535
Synonyms:
(R)-3-amino-6-(3-methylimidazo[1,2-a] pyridin-6-yl)-5-(oxazol-2-yl)-N- ((tetrahydrofuran-3-yl)methyl)pyrazine- 2-carboxamide US11571420, Compound 136
Type:
Small organic molecule
Emp. Form.:
C21H21N7O3
Mol. Mass.:
419.4365
SMILES:
Cc1cnc2ccc(cn12)-c1nc(C(=O)NC[C@H]2CCOC2)c(N)nc1-c1ncco1
: