Target
TGF-beta receptor type-1
Ligand
BDBM479981
Substrate
Meas. Tech.
Inhibition Assay
IC50
208±n/a nM
Citation
 Yang, FZhang, LShen, GHe, FTao, W 3,4-bipyridyl pyrazole derivative, and preparation method therefor and medical application thereof US Patent  US10899741 Publication Date 1/26/2021 
Target
Name:
TGF-beta receptor type-1
Synonyms:
ALK-5 Activin A receptor type II-like protein kinase of 53kD SKR4 TGF-beta receptor type I TGFBR1 TGFR1_HUMAN Transforming growth factor-beta receptor type I
Type:
enzyme
Mol. Mass.:
55968.24
Organism:
Homo sapiens (Human)
Description:
P36897
Residue:
503
  
Inhibitor
Name:
BDBM479981
Synonyms:
4-(1-Cyclobutyl-3-(6-methylpyridin-2-yl)-1H-pyrazol-4-yl)-2-(4-(methylsulfonyl)phenyl)pyridine | US10899741, Example 1
Type:
Small organic molecule
Emp. Form.:
C25H24N4O2S
Mol. Mass.:
444.549
SMILES:
Cc1cccc(n1)-c1nn(cc1-c1ccnc(c1)-c1ccc(cc1)S(C)(=O)=O)C1CCC1
: