Target
Tyrosine-protein kinase BTK
Ligand
BDBM480081
Substrate
Meas. Tech.
In Vitro Kinase Assay
IC50
<1.000±n/a nM
Citation
 Hopkins, BTMa, BPrince, RMarx, ISchulz, JNevalainen, MDechantsreiter, M Inhibiting agents for Bruton's tyrosine kinase US Patent  US10899753 Publication Date 1/26/2021 
Target
Name:
Tyrosine-protein kinase BTK
Synonyms:
AGMX1 Agammaglobulinaemia tyrosine kinase B cell progenitor kinase BPK BTK_HUMAN Tyrosine Kinase BTK Tyrosine-protein kinase BTK (BTK)
Type:
Enzyme
Mol. Mass.:
76289.95
Organism:
Homo sapiens (Human)
Description:
Q06187
Residue:
659
  
Inhibitor
Name:
BDBM480081
Synonyms:
3-(tert-butyl)-N-(3-fluoro-4-(4-((1-methyl-1H-pyrazol-3-yl)amino)-1,3,5-triazin-2-yl)-2-(trifluoromethyl)benzyl)-1,2,4-oxadiazole-5-carboxamide | US10899753, Example 20
Type:
Small organic molecule
Emp. Form.:
C22H21F4N9O2
Mol. Mass.:
519.4549
SMILES:
Cn1ccc(Nc2ncnc(n2)-c2ccc(CNC(=O)c3nc(no3)C(C)(C)C)c(c2F)C(F)(F)F)n1
: