Target
Nuclear receptor ROR-gamma
Ligand
BDBM480772
Substrate
Meas. Tech.
Ligand Binding Assay
IC50
<1000±n/a nM
Citation
 Mohan, RNuss, JHarris, J Substituted piperazines as ROR-gamma modulators US Patent  US10905687 Publication Date 2/2/2021 
Target
Name:
Nuclear receptor ROR-gamma
Synonyms:
NR1F3 Nuclear receptor ROR-gamma (RORC) RAR-related orphan receptor C (RORc) RORG RZRG Retinoid-related orphan receptor-gamma (RORc)
Type:
Enzyme Catalytic Domain
Mol. Mass.:
58218.40
Organism:
Homo sapiens (Human)
Description:
P51449
Residue:
518
  
Inhibitor
Name:
BDBM480772
Synonyms:
US10905687, Compound 48 | US20230277527, Compound 48
Type:
Small organic molecule
Emp. Form.:
C30H31F6N3O3
Mol. Mass.:
595.5759
SMILES:
CCOC(=O)C[C@H]1CN(Cc2ccc(cc2)-c2ccc(cc2)C(O)(C(F)(F)F)C(F)(F)F)CCN1Cc1ccncc1
: