Target
Pantetheinase
Ligand
BDBM480911
Substrate
Meas. Tech.
Enzyme Assay
IC50
3.04±n/a nM
Citation
 Casimiro-Garcia, AStrohbach, JWHepworth, DLovering, FEChoi, CAllais, CPWright, SW Pyrimidine carboxamides as inhibitors of Vanin-1 enzyme US Patent  US10906888 Publication Date 2/2/2021 
Target
Name:
Pantetheinase
Synonyms:
Pantetheine hydrolase VNN1 Vanin-1 | Vascular non-inflammatory molecule 1
Type:
Enzyme Catalytic Domain
Mol. Mass.:
57002.46
Organism:
Homo sapiens (Human)
Description:
O95497
Residue:
513
  
Inhibitor
Name:
BDBM480911
Synonyms:
US10906888, Example 125
Type:
Small organic molecule
Emp. Form.:
C18H23N7O
Mol. Mass.:
353.4215
SMILES:
C[C@H](Nc1ncc(cn1)C(=O)N1CCN2CCC[C@H]2C1)c1cnccn1
: