Target
Pantetheinase
Ligand
BDBM480975
Substrate
Meas. Tech.
Enzyme Assay
IC50
2.21±n/a nM
Citation
 Casimiro-Garcia, AStrohbach, JWHepworth, DLovering, FEChoi, CAllais, CPWright, SW Pyrimidine carboxamides as inhibitors of Vanin-1 enzyme US Patent  US10906888 Publication Date 2/2/2021 
Target
Name:
Pantetheinase
Synonyms:
Pantetheine hydrolase VNN1 Vanin-1 | Vascular non-inflammatory molecule 1
Type:
Enzyme Catalytic Domain
Mol. Mass.:
57002.46
Organism:
Homo sapiens (Human)
Description:
O95497
Residue:
513
  
Inhibitor
Name:
BDBM480975
Synonyms:
US10906888, Example 192
Type:
Small organic molecule
Emp. Form.:
C19H24N6O2
Mol. Mass.:
368.4329
SMILES:
CCC1(CCN(C1)C(=O)c1cnc(NC2(CC2)c2cncnc2)nc1)OC
: