Target
Apelin receptor
Ligand
BDBM480993
Substrate
Meas. Tech.
[35S]GTPγS Binding Assay
EC50
110±n/a nM
Citation
 Chen, NChen, YDebenedetto, MVDransfield, PJHarvey, JSHeath, JAHouze, JKhakoo, AYLai, SMa, ZNishimura, NPattaropong, VSwaminath, GYeh, WKreiman, C Triazole phenyl compounds as agonists of the APJ receptor US Patent  US10906890 Publication Date 2/2/2021 
Target
Name:
Apelin receptor
Synonyms:
AGTRL1 APJ_HUMAN Angiotensin receptor-like 1 Apelin receptor (APJ) G-protein coupled receptor HG11
Type:
Enzyme Catalytic Domain
Mol. Mass.:
42664.06
Organism:
Homo sapiens (Human)
Description:
P35414
Residue:
380
  
Inhibitor
Name:
BDBM480993
Synonyms:
US10906890, Example 2.0
Type:
Small organic molecule
Emp. Form.:
C24H25N9O5S
Mol. Mass.:
551.578
SMILES:
CO[C@@H]([C@H](C)S(=O)(=O)Nc1nnc(-c2cccc(c2)C#N)n1-c1c(OC)ncnc1OC)c1ncc(C)cn1
: