Target
Apelin receptor
Ligand
BDBM480998
Substrate
Meas. Tech.
[35S]GTPγS Binding Assay
EC50
1.40±n/a nM
Citation
 Chen, NChen, YDebenedetto, MVDransfield, PJHarvey, JSHeath, JAHouze, JKhakoo, AYLai, SMa, ZNishimura, NPattaropong, VSwaminath, GYeh, WKreiman, C Triazole phenyl compounds as agonists of the APJ receptor US Patent  US10906890 Publication Date 2/2/2021 
Target
Name:
Apelin receptor
Synonyms:
AGTRL1 APJ_HUMAN Angiotensin receptor-like 1 Apelin receptor (APJ) G-protein coupled receptor HG11
Type:
Enzyme Catalytic Domain
Mol. Mass.:
42664.06
Organism:
Homo sapiens (Human)
Description:
P35414
Residue:
380
  
Inhibitor
Name:
BDBM480998
Synonyms:
US10906890, Example 7.0 | US10906890, Example 8.0
Type:
Small organic molecule
Emp. Form.:
C23H23FN6O4S
Mol. Mass.:
498.53
SMILES:
COc1cccc(OC)c1-n1c(NS(=O)(=O)[C@@H](C)Cc2ncc(F)cn2)nnc1-c1ccccc1
: