Target
Programmed cell death 1 ligand 1 [19-238]/protein 1 [25-167]
Ligand
BDBM438771
Substrate
Meas. Tech.
Homogeneous Time-Resolved Fluorescence (HTRF) Binding Assay
IC50
<5±n/a nM
Citation
 Wu, LXiao, KYao, W Heterocyclic compounds as immunomodulators US Patent  US10906920 Publication Date 2/2/2021 
Target
Name:
Programmed cell death 1 ligand 1 [19-238]/protein 1 [25-167]
Synonyms:
PD-1/PD-L1
Type:
Protein
Mol. Mass.:
Description:
Components:
This complex has 2 components.
Component 1
Name:
Programmed cell death protein 1 [25-167]
Synonyms:
PD1 PDCD1_HUMAN Programmed cell death protein 1 (aa25-167) hPD-1
Type:
Enzyme Catalytic Domain
Mol. Mass.:
15954.64
Organism:
Homo sapiens (Human)
Description:
Q15116 (aa25-167)
Residue:
143
  
Component 2
Name:
Programmed cell death 1 ligand 1 [19-238]
Synonyms:
B7H1 PD-L1 PDCD1 ligand 1 PDCD1LG1 Programmed cell death 1 ligand 1 (aa19-238) hPD-L1
Type:
Enzyme Catalytic Domain
Mol. Mass.:
25191.31
Organism:
Homo sapiens (Human)
Description:
Q9NZQ7 (aa19-238)
Residue:
220
  
Inhibitor
Name:
BDBM438771
Synonyms:
(S)-4-(2-(2-((2,2'-dichloro- 3'-(5-(2,3- dihydroxypropyl)-1-methyl- 4,5,6,7-tetrahydro-1H- imidazo[4,5-c]pyridine-2- carboxamido)-[1,1'- biphenyl]-3-yl)carbamoyl)- 1-methyl-1,4,6,7-tetrahydro- 5H-imidazo[4,5-c]pyridin- 5- yl)ethyl)bicyclo[2.2.1]heptane- 1-carboxylic acid US10906920, Example 12 | US11414433, Example 12
Type:
Small organic molecule
Emp. Form.:
C41H48Cl2N8O6
Mol. Mass.:
819.776
SMILES:
Cn1c2CCN(CCC34CCC(CC3)(C4)C(O)=O)Cc2nc1C(=O)Nc1cccc(c1Cl)-c1cccc(NC(=O)c2nc3CN(C[C@H](O)CO)CCc3n2C)c1Cl
: