Target
Protein O-GlcNAcase
Ligand
BDBM481707
Substrate
Meas. Tech.
Assay for Determination of KI Values for Inhibition of O-GlcNAcase Activity
Ki
0.095±n/a nM
Citation
 McEachern, EJSelnick, HGZhou, Y Substituted piperidines thiazolyl acetamides as glycosidase inhibitors and uses thereof US Patent  US10913733 Publication Date 2/9/2021 
Target
Name:
Protein O-GlcNAcase
Synonyms:
2-acetamido-2-deoxy-β-D-glucopyranosidase (O-GlcNAcase) Beta-hexosaminidase (O-GlcNAcase) HEXC MEA5 N-acetyl-beta-D-glucosaminidase (O-GlcNAcase) OGA Protein O-GlcNAcase
Type:
Enzyme
Mol. Mass.:
102874.67
Organism:
Homo sapiens (Human)
Description:
O60502
Residue:
916
  
Inhibitor
Name:
BDBM481707
Synonyms:
N-(5-((4-(4-(N,N- dimethylsulfamoyl) benzylidene)piperidin-1- yl)methyl)thiazol-2- yl)acetamide | US10913733, Example 17
Type:
Small organic molecule
Emp. Form.:
C20H26N4O3S2
Mol. Mass.:
434.575
SMILES:
[#6]-[#7](-[#6])S(=O)(=O)c1ccc(\[#6]=[#6]-2\[#6]-[#6]-[#7](-[#6]-c3cnc(-[#7]-[#6](-[#6])=O)s3)-[#6]-[#6]-2)cc1
: