Target
Protein O-GlcNAcase
Ligand
BDBM481729
Substrate
Meas. Tech.
Assay for Determination of KI Values for Inhibition of O-GlcNAcase Activity
Ki
71.2±n/a nM
Citation
 McEachern, EJSelnick, HGZhou, Y Substituted piperidines thiazolyl acetamides as glycosidase inhibitors and uses thereof US Patent  US10913733 Publication Date 2/9/2021 
Target
Name:
Protein O-GlcNAcase
Synonyms:
2-acetamido-2-deoxy-β-D-glucopyranosidase (O-GlcNAcase) Beta-hexosaminidase (O-GlcNAcase) HEXC MEA5 N-acetyl-beta-D-glucosaminidase (O-GlcNAcase) OGA Protein O-GlcNAcase
Type:
Enzyme
Mol. Mass.:
102874.67
Organism:
Homo sapiens (Human)
Description:
O60502
Residue:
916
  
Inhibitor
Name:
BDBM481729
Synonyms:
(R,Z)-N-(5-((4-(4- methoxybenzylidene)-2- methylpiperidin-1- yl)methyl)thiazol-2- yl)acetamide | US10913733, Example 40
Type:
Small organic molecule
Emp. Form.:
C20H25N3O2S
Mol. Mass.:
371.496
SMILES:
COc1ccc(\C=C2\CCN(Cc3cnc(NC(C)=O)s3)[C@H](C)C2)cc1
: