Target
Protein O-GlcNAcase
Ligand
BDBM481735
Substrate
Meas. Tech.
Assay for Determination of KI Values for Inhibition of O-GlcNAcase Activity
Ki
2.00±n/a nM
Citation
 McEachern, EJSelnick, HGZhou, Y Substituted piperidines thiazolyl acetamides as glycosidase inhibitors and uses thereof US Patent  US10913733 Publication Date 2/9/2021 
Target
Name:
Protein O-GlcNAcase
Synonyms:
2-acetamido-2-deoxy-β-D-glucopyranosidase (O-GlcNAcase) Beta-hexosaminidase (O-GlcNAcase) HEXC MEA5 N-acetyl-beta-D-glucosaminidase (O-GlcNAcase) OGA Protein O-GlcNAcase
Type:
Enzyme
Mol. Mass.:
102874.67
Organism:
Homo sapiens (Human)
Description:
O60502
Residue:
916
  
Inhibitor
Name:
BDBM481735
Synonyms:
N-[5-({4-[(4- methoxyphenyl)methylidene] piperidin-1-yl}methyl)-1,3- thiazol-2-yl]acetamide | US10913733, Example 46
Type:
Small organic molecule
Emp. Form.:
C19H23N3O2S
Mol. Mass.:
357.47
SMILES:
[#6]-[#8]-c1ccc(\[#6]=[#6]-2/[#6]-[#6]-[#7](-[#6]-c3cnc(-[#7]-[#6](-[#6])=O)s3)-[#6]-[#6]-2)cc1
: