Target
Tyrosine-protein kinase JAK3
Ligand
BDBM292115
Substrate
Meas. Tech.
LanthaScreen Biochemical Assay
Ki
0.55±n/a nM
Citation
 Fatheree, PRJacobsen, JRBrandt, GEBenjamin, NDabros, MThalladi, VR JAK kinase inhibitor compounds for treatment of respiratory disease US Patent  US10913740 Publication Date 2/9/2021 
Target
Name:
Tyrosine-protein kinase JAK3
Synonyms:
JAK-3 JAK3_HUMAN Janus kinase 3 (JAK3) L-JAK | Leukocyte janus kinase
Type:
Protein
Mol. Mass.:
125111.08
Organism:
Homo sapiens (Human)
Description:
P52333
Residue:
1124
  
Inhibitor
Name:
BDBM292115
Synonyms:
US10100049, Example 12 US10526330, Example 12 US11299492, Example 12 | US11718616, Example 12
Type:
Small organic molecule
Emp. Form.:
C26H30F2N6O
Mol. Mass.:
480.5528
SMILES:
CCc1cc(O)c(F)cc1-c1ccc2c(n[nH]c2c1)-c1nc2CN(CC(F)CN(C)C)CCc2[nH]1
: