Target
Transient receptor potential cation channel subfamily A member 1
Ligand
BDBM481777
Substrate
Meas. Tech.
FLIPR Assay
IC50
34.0±n/a nM
Citation
 Chen, HShore, DVillemure, EVolgraf, MHu, BLu, ACridland, AWard, SBeaumier, FDery, MLarouche-Gauthier, R Oxadiazolones as transient receptor potential channel inhibitors US Patent  US10913742 Publication Date 2/9/2021 
Target
Name:
Transient receptor potential cation channel subfamily A member 1
Synonyms:
ANKTM1 TRPA1 Transformation-sensitive protein p120 | Transient receptor potential cation channel subfamily A member 1 (TRPA1)
Type:
Protein
Mol. Mass.:
127514.20
Organism:
Homo sapiens (Human)
Description:
O75762
Residue:
1119
  
Inhibitor
Name:
BDBM481777
Synonyms:
(S)-3-(2-(4- chlorophenyl)propyl)-5-((7- methyl-6-oxo-6H-purin- 1(7H)-yl)methyl)-1,3,4- oxadiazol-2(3H)-one | US10913742, Example 19
Type:
Small organic molecule
Emp. Form.:
C18H17ClN6O3
Mol. Mass.:
400.819
SMILES:
C[C@H](Cn1nc(Cn2cnc3ncn(C)c3c2=O)oc1=O)c1ccc(Cl)cc1
: