Target
Transient receptor potential cation channel subfamily A member 1
Ligand
BDBM481805
Substrate
Meas. Tech.
FLIPR Assay
IC50
65.0±n/a nM
Citation
 Chen, HShore, DVillemure, EVolgraf, MHu, BLu, ACridland, AWard, SBeaumier, FDery, MLarouche-Gauthier, R Oxadiazolones as transient receptor potential channel inhibitors US Patent  US10913742 Publication Date 2/9/2021 
Target
Name:
Transient receptor potential cation channel subfamily A member 1
Synonyms:
ANKTM1 TRPA1 Transformation-sensitive protein p120 | Transient receptor potential cation channel subfamily A member 1 (TRPA1)
Type:
Protein
Mol. Mass.:
127514.20
Organism:
Homo sapiens (Human)
Description:
O75762
Residue:
1119
  
Inhibitor
Name:
BDBM481805
Synonyms:
3-(4-chlorophenethyl)-5-((3- methyl-5-oxo-5H-thiazolo[3,2- a]pyrimidin-6-yl)methyl)-1,3,4- oxadiazol-2(3H)-one | US10913742, Example 47
Type:
Small organic molecule
Emp. Form.:
C18H15ClN4O3S
Mol. Mass.:
402.855
SMILES:
Cc1csc2ncc(Cc3nn(CCc4ccc(Cl)cc4)c(=O)o3)c(=O)n12
: