Target
Ataxin-1
Ligand
BDBM481893
Substrate
Meas. Tech.
Enzyme Inhibition Assay
IC50
6108±n/a nM
Citation
 Hert, JHunziker, DMattei, PMauser, HTang, GWang, L Octahydro-pyrrolo[3,4-c]-pyrrole derivatives and analogs thereof as autotaxin inhibitors US Patent  US10913745 Publication Date 2/9/2021 
Target
Name:
Ataxin-1
Synonyms:
ATX1 ATXN1 | SCA1
Type:
Protein
Mol. Mass.:
86941.25
Organism:
Homo sapiens (Human)
Description:
P54253
Residue:
815
  
Inhibitor
Name:
BDBM481893
Synonyms:
US10913745, Example 1.07
Type:
Small organic molecule
Emp. Form.:
C20H20Cl2N4O3
Mol. Mass.:
435.304
SMILES:
Nc1ccc(nc1)C(=O)N1C[C@@H]2CN(C[C@@H]2C1)C(=O)OCc1cc(Cl)cc(Cl)c1
: