Target
Retinol-binding protein 4
Ligand
BDBM249470
Substrate
Meas. Tech.
Scintillation Proximity Binding Assay
IC50
10.0±n/a nM
Citation
 Petrukhin, KCioffi, CJohnson, GAllikmets, RFreeman, EChen, PConlon, MZhu, L Substituted 4-phenylpiperidines, their preparation and use US Patent  US10913746 Publication Date 2/9/2021 
Target
Name:
Retinol-binding protein 4
Synonyms:
PRBP RBP RET4_HUMAN Retinol-binding protein 4 (RBP4) | spa binding assay for rbp4
Type:
Protein
Mol. Mass.:
23008.75
Organism:
Homo sapiens (Human)
Description:
P02753
Residue:
201
  
Inhibitor
Name:
BDBM249470
Synonyms:
US10072016, Compound 69 US10913746, Compound 69 US9434727, 69 | US9777010, Compound 69
Type:
Small organic molecule
Emp. Form.:
C23H26F4N4O
Mol. Mass.:
450.4724
SMILES:
Fc1cccc(C2CCN(CC2)C(=O)c2n[nH]c3CCN(CC4CC4)Cc23)c1C(F)(F)F
: