Target
Retinol-binding protein 4
Ligand
BDBM249514
Substrate
Meas. Tech.
Scintillation Proximity Binding Assay
IC50
11.5±n/a nM
Citation
 Petrukhin, KCioffi, CJohnson, GAllikmets, RFreeman, EChen, PConlon, MZhu, L Substituted 4-phenylpiperidines, their preparation and use US Patent  US10913746 Publication Date 2/9/2021 
Target
Name:
Retinol-binding protein 4
Synonyms:
PRBP RBP RET4_HUMAN Retinol-binding protein 4 (RBP4) | spa binding assay for rbp4
Type:
Protein
Mol. Mass.:
23008.75
Organism:
Homo sapiens (Human)
Description:
P02753
Residue:
201
  
Inhibitor
Name:
BDBM249514
Synonyms:
US10072016, Compound 112 US10913746, Compound 112 US9434727, 112 | US9777010, Compound 112
Type:
Small organic molecule
Emp. Form.:
C21H22F5N5O2
Mol. Mass.:
471.4237
SMILES:
CNC(=O)N1CCc2c(C1)[nH]nc2C(=O)N1CCC(CC1)c1ccc(F)c(F)c1C(F)(F)F
: