Target
Retinol-binding protein 4
Ligand
BDBM249528
Substrate
Meas. Tech.
Scintillation Proximity Binding Assay
IC50
17.0±n/a nM
Citation
 Petrukhin, KCioffi, CJohnson, GAllikmets, RFreeman, EChen, PConlon, MZhu, L Substituted 4-phenylpiperidines, their preparation and use US Patent  US10913746 Publication Date 2/9/2021 
Target
Name:
Retinol-binding protein 4
Synonyms:
PRBP RBP RET4_HUMAN Retinol-binding protein 4 (RBP4) | spa binding assay for rbp4
Type:
Protein
Mol. Mass.:
23008.75
Organism:
Homo sapiens (Human)
Description:
P02753
Residue:
201
  
Inhibitor
Name:
BDBM249528
Synonyms:
US10072016, Compound 126 US10913746, Compound 126 US9434727, 126 | US9777010, Compound 126
Type:
Small organic molecule
Emp. Form.:
C24H29F5N4O
Mol. Mass.:
484.5053
SMILES:
CC(C)(C)CN1CCc2c(C1)[nH]nc2C(=O)N1CCC(CC1)c1ccc(F)c(F)c1C(F)(F)F
: