Target
Retinol-binding protein 4
Ligand
BDBM249544
Substrate
Meas. Tech.
Scintillation Proximity Binding Assay
IC50
4.88±n/a nM
Citation
 Petrukhin, KCioffi, CJohnson, GAllikmets, RFreeman, EChen, PConlon, MZhu, L Substituted 4-phenylpiperidines, their preparation and use US Patent  US10913746 Publication Date 2/9/2021 
Target
Name:
Retinol-binding protein 4
Synonyms:
PRBP RBP RET4_HUMAN Retinol-binding protein 4 (RBP4) | spa binding assay for rbp4
Type:
Protein
Mol. Mass.:
23008.75
Organism:
Homo sapiens (Human)
Description:
P02753
Residue:
201
  
Inhibitor
Name:
BDBM249544
Synonyms:
US10072016, Compound 142 US10913746, Compound 142 US9434727, 142 | US9777010, Compound 142
Type:
Small organic molecule
Emp. Form.:
C20H15F4N5O
Mol. Mass.:
417.3596
SMILES:
Fc1ccc(c(c1)C1CCN(CC1)C(=O)c1nnc2ccc(cn12)C#N)C(F)(F)F
: