Target
Retinol-binding protein 4
Ligand
BDBM249550
Substrate
Meas. Tech.
Scintillation Proximity Binding Assay
IC50
<1.37±n/a nM
Citation
 Petrukhin, KCioffi, CJohnson, GAllikmets, RFreeman, EChen, PConlon, MZhu, L Substituted 4-phenylpiperidines, their preparation and use US Patent  US10913746 Publication Date 2/9/2021 
Target
Name:
Retinol-binding protein 4
Synonyms:
PRBP RBP RET4_HUMAN Retinol-binding protein 4 (RBP4) | spa binding assay for rbp4
Type:
Protein
Mol. Mass.:
23008.75
Organism:
Homo sapiens (Human)
Description:
P02753
Residue:
201
  
Inhibitor
Name:
BDBM249550
Synonyms:
US10072016, Compound 148 US10913746, Compound 148 US9434727, 148 | US9777010, Compound 148
Type:
Small organic molecule
Emp. Form.:
C19H19ClFN5O
Mol. Mass.:
387.838
SMILES:
Fc1cccc(C2CCN(CC2)C(=O)c2n[nH]c3CN(CCc23)C#N)c1Cl
: