Target
Retinol-binding protein 4
Ligand
BDBM249565
Substrate
Meas. Tech.
Scintillation Proximity Binding Assay
IC50
15.3±n/a nM
Citation
 Petrukhin, KCioffi, CJohnson, GAllikmets, RFreeman, EChen, PConlon, MZhu, L Substituted 4-phenylpiperidines, their preparation and use US Patent  US10913746 Publication Date 2/9/2021 
Target
Name:
Retinol-binding protein 4
Synonyms:
PRBP RBP RET4_HUMAN Retinol-binding protein 4 (RBP4) | spa binding assay for rbp4
Type:
Protein
Mol. Mass.:
23008.75
Organism:
Homo sapiens (Human)
Description:
P02753
Residue:
201
  
Inhibitor
Name:
BDBM249565
Synonyms:
US10072016, Compound 163 US10913746, Compound 163 US9434727, 163 | US9777010, Compound 163
Type:
Small organic molecule
Emp. Form.:
C20H24ClFN4O
Mol. Mass.:
390.882
SMILES:
CCN1CCc2[nH]nc(C(=O)N3CCC(CC3)c3cccc(F)c3Cl)c2C1
: