Target
Isocitrate dehydrogenase [NADP] cytoplasmic [R132H]
Ligand
BDBM482794
Substrate
Meas. Tech.
Mutant IDH1 R132H Biochemical Assay
IC50
4100±n/a nM
Citation
 Panknin, OHartung, IRehwinkel, HNguyen, DZorn, LHelfrich, PZimmermann, KNeuhaus, R Fused imidazoles as mIDH1 inhibitors US Patent  US10919862 Publication Date 2/16/2021 
Target
Name:
Isocitrate dehydrogenase [NADP] cytoplasmic [R132H]
Synonyms:
Cytosolic NADP-isocitrate dehydrogenase (IDH1)(R132H) IDH1 R132H IDHC_HUMAN Isocitrate dehydrogenase 1 mutant (R132H) Isocitrate dehydrogenase [NADP] cytoplasmic (IDH1)(R132H) PICD
Type:
Protein
Mol. Mass.:
46641.74
Organism:
Homo sapiens (Human)
Description:
Human IDH1 R132H (SEQ ID No. 2 in patent). First three are removed. Google patent parsed wrong.
Residue:
414
  
Inhibitor
Name:
BDBM482794
Synonyms:
3-(1-[(1R,4R,5S)-4-hydroxy-3,35-trimethylcyclohexyl]-2-{[4-(trifluoromethoxy)-phenyl]amino}-1H-benzimidazol-5-yl)propanoic acid | US10919862, Example 2-5
Type:
Small organic molecule
Emp. Form.:
C26H30F3N3O4
Mol. Mass.:
505.5293
SMILES:
C[C@H]1C[C@H](CC(C)(C)[C@@H]1O)n1c(Nc2ccc(OC(F)(F)F)cc2)nc2cc(CCC(O)=O)ccc12
: