Target
Histone deacetylase 1
Ligand
BDBM482854
Substrate
Meas. Tech.
Reporter Displacement Assay
Kd
275±n/a nM
Citation
 Jefson, MRLowe, III, JADey, FBergmann, ASchoop, AFuller, NO Hetero-halo inhibitors of histone deacetylase US Patent  US10919902 Publication Date 2/16/2021 
Target
Name:
Histone deacetylase 1
Synonyms:
Cereblon/Histone deacetylase 1 HDAC1 Histone deacetylase 1 (HDAC1) RPD3L1
Type:
Enzyme
Mol. Mass.:
55090.27
Organism:
Homo sapiens (Human)
Description:
Q13547
Residue:
482
  
Inhibitor
Name:
BDBM482854
Synonyms:
US10919902, Compound 100
Type:
Small organic molecule
Emp. Form.:
C20H16F2N4O
Mol. Mass.:
366.364
SMILES:
Nc1cc(F)c(cc1NC(=O)N1Cc2ccncc2C1)-c1ccc(F)cc1
: