Target
Histone deacetylase 2
Ligand
BDBM483365
Substrate
Meas. Tech.
Reporter Displacement Assay
Kd
25±n/a nM
Citation
 Jefson, MRLowe, III, JADey, FBergmann, ASchoop, AFuller, NO Hetero-halo inhibitors of histone deacetylase US Patent  US10919902 Publication Date 2/16/2021 
Target
Name:
Histone deacetylase 2
Synonyms:
Cereblon/Histone deacetylase 2 HDAC2 Histone deacetylase 2 (HDAC2) | Human HDAC2
Type:
Chromatin regulator; hydrolase; repressor
Mol. Mass.:
55356.54
Organism:
Homo sapiens (Human)
Description:
Q92769
Residue:
488
  
Inhibitor
Name:
BDBM483365
Synonyms:
US10919902, Compound 109
Type:
Small organic molecule
Emp. Form.:
C17H18FN3O2
Mol. Mass.:
315.3421
SMILES:
Nc1ccc(nc1NC(=O)C1CCOCC1)-c1ccc(F)cc1
: