Target
Mitogen-activated protein kinase kinase kinase 5
Ligand
BDBM483457
Substrate
Meas. Tech.
RBC Kinase Assay Protocol
IC50
6.60±n/a nM
Citation
 Xu, YHalcomb, RKirschberg, TARomero, FA Tricyclic ASK1 inhibitors US Patent  US10919911 Publication Date 2/16/2021 
Target
Name:
Mitogen-activated protein kinase kinase kinase 5
Synonyms:
ASK1 MAP3K5 MEKK5
Type:
Protein
Mol. Mass.:
154514.93
Organism:
Homo sapiens (Human)
Description:
Q99683
Residue:
1374
  
Inhibitor
Name:
BDBM483457
Synonyms:
US10919911, Example 79
Type:
Small organic molecule
Emp. Form.:
C23H20FN7O2
Mol. Mass.:
445.449
SMILES:
Cc1cc(F)c(cc1-n1cnc(c1)C1CC1)C(=O)Nc1cccc2-c3nnnn3CCOc12
: