Target
Beta-2 adrenergic receptor
Ligand
BDBM483478
Substrate
Meas. Tech.
Ligand-Displacement Binding
Ki
341000±23000 nM
Citation
 Wainer, IWBernier, MToll, LRJimenez, LA Use of fenoterol and fenoterol analogues in the treatment of glioblastomas and astrocytomas US Patent  US10925840 Publication Date 2/23/2021 
Target
Name:
Beta-2 adrenergic receptor
Synonyms:
ADRB2 ADRB2_HUMAN Beta-2 adrenoceptor | Beta-2 adrenoreceptor
Type:
Mol. Mass.:
46461.69
Organism:
Homo sapiens (Human)
Description:
P07550
Residue:
413
  
Inhibitor
Name:
BDBM483478
Synonyms:
US10925840, Compound (R-S)-5
Type:
Small organic molecule
Emp. Form.:
C22H24O3
Mol. Mass.:
336.4242
SMILES:
C[C@H](CC[C@H](O)c1cc(O)cc(O)c1)Cc1cccc2ccccc12
: